{"text_format":"1","workbook":"xlsx","n_sheets":5,"sheets":["PRESENTAZIONE","FATTURA","ELENCO ANAGRAFICA","FATTURA PROFORMA","ARCHIVIO"],"not_rendered":{"charts":0,"images":7,"macros":1,"external_links":0,"defined_names":1,"comments":0,"pivot_tables":0},"unopened":[],"bounds":{"document_bytes":16777216,"sheet_cells":100000,"rows_first":2000,"rows_last":500,"rows_between":2000,"halvings":0,"cell_chars":16384,"cell_head_chars":4096},"cells_cut":0,"cells_raw":0,"read":"whole","date_system":"1900"}

{"sheet":"PRESENTAZIONE","index":0,"n_rows":0,"n_cols":0,"rows_kept":0,"cut":false,"hidden":false,"merged":[]}

{"sheet":"FATTURA","index":1,"n_rows":39,"n_cols":12,"rows_kept":39,"cut":false,"hidden":false,"merged":[[24,1,24,3],[25,1,25,3],[26,1,26,3],[27,1,27,3],[38,6,38,8],[38,3,38,5],[38,0,38,2],[28,1,28,3],[29,1,29,3],[30,1,30,3],[31,1,31,3],[32,1,32,3],[35,0,35,3],[33,1,33,3],[3,0,3,4],[4,0,4,4],[5,0,5,4],[7,5,7,8],[37,0,37,2],[37,3,37,5],[37,6,37,8],[15,1,15,3],[16,1,16,3],[17,1,17,3],[18,1,18,3],[19,1,19,3],[20,1,20,3],[21,1,21,3],[22,1,22,3],[23,1,23,3]]}
[5]
[]
[]
["  Tel.0881-545676 "]
[" Cell.3201198712"]
["www.soluzionimediaweb.it    "]
[null,"   "]
[null,null,null,null,null,{"$f":"INDEX('ELENCO ANAGRAFICA'!B3:B100,A1,1)","v":"Ditta demo 5"}]
[null,null,null,null,null,{"$f":"INDEX('ELENCO ANAGRAFICA'!D3:D100,A1,1)","v":"Via Bari, 1"},null,{"$f":"INDEX('ELENCO ANAGRAFICA'!E3:E100,A1,1)","v":"Bari"},{"$f":"INDEX('ELENCO ANAGRAFICA'!F3:F100,A1,1)","v":11116}]
[null,null,null,null,"     Tel.",{"$f":"INDEX('ELENCO ANAGRAFICA'!I3:I100,A1,1)","v":3330000005}]
[null,null,null,null,"     Cell.",{"$f":"INDEX('ELENCO ANAGRAFICA'!K3:K100,A1,1)","v":3330000005},"   P.Iva",{"$f":"INDEX('ELENCO ANAGRAFICA'!M3:M100,A1,1)","v":12345678905}]
[null,null,null,null," Cod. Fisc.",{"$f":"INDEX('ELENCO ANAGRAFICA'!L3:L100,A1,1)","v":"123456789aaaaa5"}]
[]
["       N","Data","Modello Atrezz.",null,"Dati","Codice Attrezz.",null,"Valore"]
[16," 19/05/16"]
["n","Descrizione articoli",null,null,"Qtà","Prezzo","%","Iva","Importo"]
[1,"Consulenza Marketing",null,null,1,150,0.22,{"$f":"(F17*G17)","v":33},{"$f":"SUM(F17+H17)","v":183}]
[2,"Servizi di Assistenza",null,null,1,170,0.22,{"$f":"(F18*G18)","v":37.4},{"$f":"SUM(F18+H18)","v":207.4}]
[3,"Assistenza Tecnica/Legale",null,null,1,220,0.1,{"$f":"(F19*G19)","v":22},{"$f":"(F19+H19)","v":242}]
[4,"Verifica Bilancio",null,null,1,150,0.1,{"$f":"(F20*G20)","v":15},{"$f":"(F20+H20)","v":165}]
[5,"Registrazione Dominio",null,null,1,99,0.22,{"$f":"(F21*G21)","v":21.78},{"$f":"(F21+H21)","v":120.78}]
[]
[]
[]
[]
[]
[]
[]
[]
[]
[]
[]
[]
[]
["TIPO PAGAMENTO"]
["ASSEGNO BANCARIO"]
[]
["TOTALE IMPONIBILE",null,null,"TOTALE IVA",null,null,"TOTALE  FATTURA"]
[{"$f":"SUM(F17:F21)","v":789},null,null,{"$f":"SUM(H17:H21)","v":129.18},null,null,{"$f":"SUM(I17:I21)","v":918.18},null,null,null,null,"SI"]

{"sheet":"ELENCO ANAGRAFICA","index":2,"n_rows":12,"n_cols":16,"rows_kept":12,"cut":false,"hidden":false,"merged":[[0,0,0,20]]}
["DATI CLIENTI"]
["CODICE","RAGIONE SOCIALE","NOME/COGNOME","INDIRIZZO","CITTA","CAP","E-MAIL","SITO","TEL","FAX","CELL","COD. FISCALE","P. IVA","RAP. LEGALE","NATO A","NATO IL"]
[1,"Ditta demo 1","Mario Rosso","Via Cagliari,1","Cagliari",11112,"email1@emailcliente.it","www.sitocliente1.it",3330000001,3330000001,3330000001,"123456789aaaaa1",12345678901,"Mario Rosso","Cagliari","1975-03-12"]
[2,"Ditta demo 2","Giuseppe Bianco","Via Napoli,1   ","Napoli",11113,"email2@emailcliente.it","www.sitocliente2.it",3330000002,3330000002,3330000002,"123456789aaaaa2",12345678902,"Giuseppe Bianco","Napoli","1990-07-04"]
[3,"Ditta demo 3","Antonio Azzurro","Via Roma,1     ","Roma",11114,"email3@emailcliente.it","www.sitocliente3.it",3330000003,3330000003,3330000003,"123456789aaaaa3",12345678903,"Antonio Azzurro","Roma","1985-08-30"]
[4,"Ditta demo 4","Andrea Verde","Via Torino,1","Torino",11115,"email4@emailcliente.it","www.sitocliente4.it",3330000004,3330000004,3330000004,"123456789aaaaa4",12345678904,"Andrea Verde","Torino","1989-09-09"]
[5,"Ditta demo 5","Francesco Nero","Via Bari, 1","Bari",11116,"email5@emailcliente.it","www.sitocliente5.it",3330000005,3330000005,3330000005,"123456789aaaaa5",12345678905,"Francesco Nero","Bari","1988-08-08"]
[6,"Ditta demo 6","Giovanni Grigio","Via Palermo,1","Palermo",11117,"email6@emailcliente.it","www.sitocliente6.it",3330000006,3330000006,3330000006,"123456789aaaaa6",12345678906,"Mariano Giallo","Palermo","1977-07-07"]
[7,"Ditta demo 7","Mariano Giallo","Via Milano,1","Milano",11118,"email7@emailcliente.it","www.sitocliente7.it",3330000007,3330000007,3330000007,"123456789aaaaa7",12345678907,"Giovanni Giallo","Milano","1966-06-06"]
[8,"Ditta demo 8","Alessandro Marrone","Via Venezia,1","Venezia",11119,"email8@emailcliente.it","www.sitocliente8.it",3330000008,3330000008,3330000008,"123456789aaaaa8",12345678908,"Alessandro Marrone","Venezia","1955-05-05"]
[9,"Ditta demo 9","Luca Arancio","Via Genova,1","Genova",11110,"email9@emailcliente.it","www.sitocliente9.it",3330000009,3330000009,3330000009,"123456789aaaaa9",12345678909,"Luca Arancio","Genova","1973-11-23"]
[10,"Ditta demo 10","Ciro Viola","Via Firenze,1","Firenze",11111,"email10@emailcliente.it","www.sitocliente10.it",3330000010,3330000010,3330000010,"123456789aaaa10",12345678900,"Ciro Viola","Firenze","1992-03-06"]

{"sheet":"FATTURA PROFORMA","index":3,"n_rows":39,"n_cols":9,"rows_kept":39,"cut":false,"hidden":false,"merged":[[30,1,30,3],[19,1,19,3],[7,5,7,8],[15,1,15,3],[16,1,16,3],[17,1,17,3],[18,1,18,3],[38,6,38,8],[32,1,32,3],[33,1,33,3],[34,0,34,3],[34,4,34,8],[37,0,37,2],[37,3,37,5],[37,6,37,8],[35,0,35,3],[3,1,3,5],[4,1,4,5],[5,1,5,5],[38,0,38,2],[38,3,38,5],[31,1,31,3],[20,1,20,3],[21,1,21,3],[22,1,22,3],[23,1,23,3],[24,1,24,3],[25,1,25,3],[26,1,26,3],[27,1,27,3],[28,1,28,3],[29,1,29,3]]}
[1]
[]
[]
[null," Tel.0881-545676 "]
[null,"Cell.3201198712"]
[null,"www.mediaweb.it    "]
[]
[null,null,null,null,null,{"$f":"INDEX('ELENCO ANAGRAFICA'!B3:B100,A1,1)","v":"Ditta demo 1"}]
[null,null,null,null,null,{"$f":"INDEX('ELENCO ANAGRAFICA'!D3:D100,A1,1)","v":"Via Cagliari,1"},null,{"$f":"INDEX('ELENCO ANAGRAFICA'!E3:E100,A1,1)","v":"Cagliari"},{"$f":"INDEX('ELENCO ANAGRAFICA'!F3:F100,A1,1)","v":11112}]
[null,null,null,null,null,{"$f":"INDEX('ELENCO ANAGRAFICA'!I3:I100,A1,1)","v":3330000001},null,{"$f":"INDEX('ELENCO ANAGRAFICA'!I3:I100,A1,1)","v":3330000001}]
[null,null,null,null,null,{"$f":"INDEX('ELENCO ANAGRAFICA'!K3:K100,A1,1)","v":3330000001},null,{"$f":"INDEX('ELENCO ANAGRAFICA'!M3:M100,A1,1)","v":12345678901}]
[null,null,null,null,null,{"$f":"INDEX('ELENCO ANAGRAFICA'!L3:L100,A1,1)","v":"123456789aaaaa1"}]
[]
["       N","Data","Modello Atrezz.",null,"Dati","Codice Attrezz.",null,"Valore"]
[6," 12/05/16"]
["n","Descrizione articoli",null,null,"Qtà","Prezzo","%","Iva","Importo"]
[1,"Consulenza Marketing",null,null,1,150,0.22,{"$f":"(F17*G17)","v":33},{"$f":"SUM(F17+H17)","v":183}]
[2,"Servizi di Assistenza",null,null,1,170,0.22,{"$f":"(F18*G18)","v":37.4},{"$f":"SUM(F18+H18)","v":207.4}]
[3,"Assistenza Tecnica/Legale",null,null,1,220,0.1,{"$f":"(F19*G19)","v":22},{"$f":"(F19+H19)","v":242}]
[4,"Verifica Bilancio",null,null,1,150,0.1,{"$f":"(F20*G20)","v":15},{"$f":"(F20+H20)","v":165}]
[5,"Registrazione Dominio",null,null,1,99,0.22,{"$f":"(F21*G21)","v":21.78},{"$f":"(F21+H21)","v":120.78}]
[]
[]
[]
[]
[]
[]
[]
[]
[]
[]
[]
[]
[]
["TIPO PAGAMENTO",null,null,null,"FATTURA PROFORMA"]
["ASSEGNO BANCARIO"]
[]
["TOTALE IMPONIBILE",null,null,"TOTALE IVA",null,null,"TOTALE DOCUMENTO"]
[{"$f":"SUM(F17:F21)","v":789},null,null,{"$f":"SUM(H17:H21)","v":129.18},null,null,{"$f":"SUM(I17:I21)","v":918.18}]

{"sheet":"ARCHIVIO","index":4,"n_rows":15,"n_cols":15,"rows_kept":15,"cut":false,"hidden":false,"merged":[]}
["ELENCO FATTURE EMESSE",null,null,null,null,null,null,null,null,null,"N.FATTURE",null,"TOT IMPONIBILE","TOT. IVA","TOTALE"]
[null,null,null,null,null,null,null,null,null,null,{"$f":"COUNTA(B18:B26)","v":0},null,{"$f":"SUM(D18:D26)","v":0},{"$f":"SUM(E18:E26)","v":0},{"$f":"SUM(F18:F26)","v":0}]
["CLIENTE","FATT. N.","DATA FATTURA","IMPONIBILE","IVA","TOTALE FATTURA","PAGATO CLIENTE","TIPO PAGAMENTO"]
["cliente1",6," 19/05/16",789,129.18,918.18,"SI","ASSEGNO BANCARIO"]
["cliente2",6," 19/05/16",789,129.18,918.18,"SI","ASSEGNO BANCARIO"]
["cliente3",6," 19/05/16",789,129.18,918.18,"No","ASSEGNO BANCARIO"]
["cliente4",6," 19/05/16",789,129.18,918.18,"No","ASSEGNO BANCARIO"]
["cliente5",6," 19/05/16",789,129.18,918.18,"Si","ASSEGNO BANCARIO"]
["cliente6",6," 19/05/16",789,129.18,918.18,"No","ASSEGNO BANCARIO"]
["cliente7",6," 19/05/16",789,129.18,918.18,"SI","ASSEGNO BANCARIO"]
["cliente6",6," 19/05/16",789,129.18,918.18,"No","ASSEGNO BANCARIO"]
["cliente1",6," 19/05/16",789,129.18,918.18,"SI","ASSEGNO BANCARIO"]
["cliente3",6," 19/05/16",789,129.18,918.18,"SI","ASSEGNO BANCARIO"]
["cliente6",16," 19/05/16",789,129.18,918.18,"SI","ASSEGNO BANCARIO"]
["cliente2",16," 19/05/16",789,129.18,918.18,"SI","ASSEGNO BANCARIO"]